HUMANITIES-THESAURUS
type: ConceptScheme

Ιστορικές επαγγελματικές ομάδες
type: Concept
notation: 2636
preferred label: Historical occupational groups @en
narrower: Ατέσηδες

Ατέσηδες
type: Concept
created: 2020-10-20
creator: Φαλιέρου Αναστασία (ΑΑ)
creator: Falierou Anastasia (AA) @la
preferred label: Atescis @en
contributor: Κατσιαδάκη Ελένη (ΑΑ)
contributor: Katsiadakis Helen (AA) @en
in scheme: HUMANITIES-THESAURUS
source: Ήμελλου & Πολυμέρου-Καμηλάκη 1983
modified: 2020-10-20
scope note: Θερμαστές χυτηρίου στις παραδοσιακές κοινωνίες της οθωμανικής περιόδου. Η λέξη προέρχεται από το τουρκικό "ateş" που σημαίνει φωτιά.
scope note: Casting heaters in the traditional societies of the Ottoman period. The word comes from the Turkish "ateş" which means fire. @en
notation: 2638
status: Εκδοθείς
broader: Ιστορικές επαγγελματικές ομάδες