Επιστημονικά όργανα
type: Concept
notation: 1888
preferred label: Scientific instruments @en
narrower: Σεισμογράφοι

Σεισμολογία
type: Concept
notation: 2520
preferred label: Seismology @en
related: Σεισμογράφοι

HUMANITIES-THESAURUS
type: ConceptScheme

Ηφαιστειακές εκρήξεις
type: Concept
notation: 1836
preferred label: Volcanic eruptions @en
related: Σεισμογράφοι

Σεισμογράφοι
type: Concept
scope note: Όργανα που καταγράφουν τις ταλαντώσεις του εδάφους, οι οποίες προκαλούνται, για παράδειγμα, από σεισμούς, ηφαιστειακή δραστηριότητα και εκρήξεις. Οι πρώτοι σχετικά ακριβείς σεισμογράφοι κατασκευάστηκαν στο δεύτερο μισό του 19ου αιώνα, συμβάλλοντας σημαντικά στη διαμόρφωση του κλάδου της σεισμολογίας.
scope note: Instruments that record ground oscillations, which are caused, for example, by earthquakes, volcanic activity, and explosions. The first quite precise seismographs were constructed in the second half of the 19th century, contributing significantly to the shaping of the discipline of seismology. @en
related: Ηφαιστειακές εκρήξεις
related: Σεισμολογία
related: Σεισμοί
contributor: Katsiadakis Helen (AA) @en
contributor: Κατσιαδάκη Ελένη (ΑΑ)
modified: 2020-08-24
source: Daintith & Martin 2010
source: Oreskes 2001
source: Bourgeois 2005
preferred label: Seismographs @en
created: 2020-08-04
broader: Επιστημονικά όργανα
status: Εκδοθείς
notation: 2600
in scheme: HUMANITIES-THESAURUS
creator: Μεργούπη-Σαβαΐδου Ειρήνη (ΑΑ)
creator: Mergoupi-Savaidou Eirini (AA) @en

Σεισμοί
type: Concept
notation: 1832
preferred label: Earthquakes @en
related: Σεισμογράφοι