Αποστροφή προς το κοινό
type: Concept
preferred label: Anrede ans Publikum @de
preferred label: Addresse au publique @fr
preferred label: Address to the audience @en
modified: 2019-02-12
notation: 257
related: Παράβαση (θέατρο)
source: Escolme 2005
source: Ridout 2006
broader: Μέθοδοι
creator: Γουλή Ελένη (ΑΑ)
creator: Goulis Helen (AA) @la
status: Εκδοθείς
contributor: Κατσιαδάκη Ελένη (ΑΑ)
contributor: Katsiadakis Helen (AA) @en
scope note: Τεχνική αποστασιοποίησης και απομυθοποίησης, η αποστροφή προς το κοινό είναι η λειτουργία κατά την οποία ο ηθοποιός απευθύνει τμήμα του κειμένου (αυτοσχεδιαστικό ή μη) άμεσα στο κοινό, βγαίνοντας από το ρόλο που υποδύεται και διαλύοντας τη θεατρική ψευδαίσθηση και τη μυθοπλασία.
scope note: As a technique of distanciation and disillusionment, the address to the public is a function during which the actor addresses part of the text (improvised or not) directly to the audience, stepping out of the role and smashing theatre illusion and fiction. @en
in scheme: HUMANITIES-THESAURUS
created: 2015-10-30

Παράβαση (θέατρο)
type: Concept
notation: 1802
preferred label: Parabassis @en
preferred label: Parabase @de
related: Αποστροφή προς το κοινό

Μέθοδοι
type: Concept
notation: 31
preferred label: Methods @en
narrower: Αποστροφή προς το κοινό

HUMANITIES-THESAURUS
type: ConceptScheme