HUMANITIES-THESAURUS
type: ConceptScheme

Philosophical psychology
type: Concept
in scheme: HUMANITIES-THESAURUS
creator: Mergoupi-Savaidou Eirini (AA)
creator: Μεργούπη-Σαβαΐδου Ειρήνη (ΑΑ) @el
broader: Philosophy of mind
preferred label: Φιλοσοφική ψυχολογία @el
contributor: Κατσιαδάκη Ελένη (ΑΑ) @el
contributor: Katsiadakis Helen (AA)
modified: 2020-06-29
scope note: Philosophical psychology investigates folk psychology, a body of commonsensical, protoscientific views about mental phenomena. Such investigations attempt to articulate and refine views found in folk psychology about conceptualization, memory, perception, sensation, consciousness, belief, desire, intention, reasoning, action, and so on.
scope note: Η φιλοσοφική ψυχολογία ερευνά την ψυχολογία του κοινού νου, ένα σύνολο προεπιστημονικών απόψεων που έχει διαμορφώσει η κοινή λογική για τα νοητικά φαινόμενα. Αυτές οι έρευνες επιχειρούν να αρθρώσουν και να εκλεπτύνουν τις απόψεις της ψυχολογίας του κοινού νου για τη διαμόρφωση των εννοιών, τη μνήμη, την αντίληψη, την αίσθηση, τη συνείδηση, την πεποίθηση, την επιθυμία, την πρόθεση, τη συλλογιστική σκέψη, την πράξη, κ.λπ. @el
status: Εκδοθείς
notation: 2524
source: Audi 2011
created: 2020-06-07

Philosophy of mind
type: Concept
notation: 2463
preferred label: Φιλοσοφία του νου @el
narrower: Philosophical psychology