Συλλογικότητες και ομάδες
type: Concept
notation: 26
preferred label: Collectivities and groups @en
narrower: Πεντακοσιομέδιμνοι

Πεντακοσιομέδιμνοι
type: Concept
creator: Χρυσοβιτσάνος Γεράσιμος (ΑΑ)
creator: Chrysovitsanos Gerasimos (AA) @fr
scope note: One of the four classes in which Athenian citizens were divided from the 6th century BC according to the income their property could generate. The class of pentakosiomedimnoi consisted of citizens whose land yielded at least 500 medimnoi of corn or the equivalent in other produce. Initially, archons were chosen among citizens from this class. Later members of other classes could also hold senior offices. @en
scope note: Μία από τις τέσσερις τάξεις στις οποίες διαιρούνταν οι Αθηναίοι πολίτες από τον 6ο αιώνα π.Χ. ανάλογα με το εισόδημα που μπορούσε να αποφέρει η περιουσία τους. Στην τάξη των πεντακοσιομέδιμνων ανήκαν πολίτες των οποίων η γη μπορούσε να αποδώσει τουλάχιστον 500 μεδίμνους καλαμποκιού ή άλλου καρπού. Αρχικά επιλέγονταν οι άρχοντες μόνο από αυτή την τάξη, αργότερα μπορούσαν να κατέχουν ανώτερα αξιώματα και μέλη των άλλων τάξεων.
modified: 2020-10-10
alternative label: Five-hundred-bushel men @en
source: Gomme, Cadoux & Rhodes 2012a
preferred label: Pentakosiomedimnoi @en
in scheme: HUMANITIES-THESAURUS
contributor: Katsiadakis Helen (AA) @en
contributor: Κατσιαδάκη Ελένη (ΑΑ)
notation: 2504
broader: Συλλογικότητες και ομάδες
created: 2020-05-29
status: Εκδοθείς

HUMANITIES-THESAURUS
type: ConceptScheme