HUMANITIES-THESAURUS
type: ConceptScheme

Propositional objects
type: Concept
notation: 25
preferred label: Προτασιακά αντικείμενα @el
narrower: Morality

Applied ethics
type: Concept
notation: 2425
preferred label: Εφαρμοσμένη ηθική @el
related: Morality

Moral psychology
type: Concept
notation: 2462
preferred label: Ηθική ψυχολογία @el
related: Morality

Morality
type: Concept
source: Audi 2011
modified: 2020-08-06
scope note: An informal public system applying to all rational persons, governing behavior that affects others, having the lessening of evil or harm as its goal, and including what are commonly known as the moral rules, moral ideals, and moral virtues.
scope note: Ένα άτυπο δημόσιο σύστημα το οποίο εφαρμόζεται σε όλα τα ορθολογικά άτομα, καθοδηγεί τη συμπεριφορά που επηρεάζει τους άλλους, έχει ως στόχο τη μικρότερη επενέργεια του κακού ή της επιβλαβούς συμπεριφοράς, και περιλαμβάνει ό,τι είναι κοινώς γνωστό ως "ηθικές αρχές", "ηθικά ιδεώδη" και "ηθικές αξίες". @el
contributor: Katsiadakis Helen (AA)
contributor: Κατσιαδάκη Ελένη (ΑΑ) @el
preferred label: Ηθικότητα @el
broader: Propositional objects
status: Εκδοθείς
creator: Μεργούπη-Σαβαΐδου Ειρήνη (ΑΑ) @el
creator: Mergoupi-Savaidou Eirini (AA)
in scheme: HUMANITIES-THESAURUS
created: 2020-05-04
related: Moral psychology
related: Applied ethics
related: Ethics
notation: 2459

Ethics
type: Concept
notation: 2421
preferred label: Ηθική @el
related: Morality