HUMANITIES-THESAURUS
type: ConceptScheme

Μανιερισμός
type: Concept
source: Clarke 2001
source: Ρηντ κ.ά. 1986
source: Πανεπιστήμιο της Οξφόρδης 1998
source: Frazier 2000
status: Εκδοθείς
creator: Ξηροπαϊδης Γιώργος (ΑΣΚΤ)
creator: Xiropaidis Georgios (ASFA) @de
contributor: Βερναρδάκη Ελένη (ΑΑ)
contributor: Vernardaki Eleni (AA) @fr
in scheme: HUMANITIES-THESAURUS
modified: 2019-11-20
notation: 241
scope note: A confusing term, subject to radically different interpretations but generally used to describe the art in Italy which directly succeeded that of the Renaissance and preceded the Baroque. Its first widespread use, in the 17th century, was pejorative, implying an overelaborate distortion, an imbalance, and a neurosis. @en
scope note: Όρος που αναφέρεται: α) σε κάθε είδους εκζήτηση στο ύφος και β) ειδικότερα στην ιταλική ζωγραφική, γλυπτική και αρχιτεκτονική της περιόδου ανάμεσα στην ακμή της Αναγέννησης και το Μπαρόκ.
created: 2015-10-15
preferred label: Mannerism @en
broader: Καλλιτεχνικά ρεύματα

Καλλιτεχνικά ρεύματα
type: Concept
notation: 27
narrower: Μανιερισμός