HUMANITIES-THESAURUS
type: ConceptScheme

Θέατρο της σκληρότητας
type: Concept
preferred label: Theatre of cruelty @en
preferred label: Theater der Grausamkeit @de
preferred label: Théâtre de la cruauté @fr
contributor: Κατσιαδάκη Ελένη (ΑΑ)
contributor: Katsiadakis Helen (AA) @en
scope note: Term coined in the 1930s by Antonin Artaud to describe his manifesto theory for the theatre he envisaged. Attacking Western bourgeois culture en bloc, he championed the necessity for an uncompromising mise-en-scène, that would disentangle theatre from literature and the tyranny of the word, bringing together actor and spectator in a mystical and shocking experience. The latter entailed subjecting the spectators to emotional shock treatment, to free them from the grip of discursive and logical thought. He sought to combine his theories with elements of Eastern dance drama to create a violent and ritualistic form of theatre. The text is offered in a kind of ritual incantation (rather than being spoken in the mode of psychological interpretation). The whole stage is used as in a ritual, as a producer of images (hieroglyphs) addressed to the spectator's unconscious. The innovative ideas introduced in relation to the spiritual and the holistic view of art, the cultural and anthropological interest in performance, the imagist and sensuous conception of the theatre event, the new role of the audience as one of participation and visceral involvement, the redefinition of the performance text and the emphasis on theatre as a process and not a finished product had a profound impact on the physical experiments of the 1960s and 1970s. @en
scope note: Όρος που επινοήθηκε τη δεκαετία του 1930 από τον Antonin Artaud για να περιγράψει τη θεωρία-μανιφέστο για το θέατρο που οραματιζόταν. Επιτιθέμενος συνολικά στη δυτική αστική κουλτούρα, υπερασπίστηκε την αναγκαιότητα για μια ασυμβίβαστη σκηνοθεσία, που θα αποσυνδέει το θέατρο από τη λογοτεχνία και την τυραννία της λέξης και θα φέρνει κοντά ηθοποιό και θεατή σε μια μυστικιστική και συγκλονιστική εμπειρία. Αυτή συνεπαγόταν την υποβολή των θεατών σε συναισθηματικά σοκ, προκειμένου να απελευθερωθούν από τον εγκλωβισμό στη λογοκρατία και την ορθολογική σκέψη. Επιζήτησε να συνδυάσει τις θεωρίες του με στοιχεία του ασιατικού χορευτικού δράματος για να δημιουργήσει μια βίαιη, τελετουργική μορφή θεάτρου. Το κείμενο εκφέρεται σε ένα είδος τελετουργικής επωδού (αντί να αποδίδεται με τον τρόπο της ψυχολογικής ερμηνείας). Όλη η σκηνή χρησιμοποιείται σαν σε τελετουργία και παράγει εικόνες (ιερογλυφικά) που απευθύνονται στο ασυνείδητο του θεατή. Οι καινοτόμες ιδέες του για την πνευματικότητα και μια ολιστική θεώρηση της τέχνης, το πολιτισμικό και ανθρωπολογικό ενδιαφέρον για την παράσταση, την εικονιστική και αισθητηριακή αντίληψη του θεατρικού γεγονότος, τον νέο ρόλο του κοινού ως συμμέτοχου και συνδημιουργού, τον επαναπροσδιορισμό του παραστασιακού κειμένου και την έμφαση στο θέατρο ως διαδικασία και όχι ως τελικό προϊόν είχαν βαθιά επίδραση στα καλλιτεχνικά πειράματα σε σωματικές μορφές έκφρασης των δεκαετιών του 1960 και του 1970.
created: 2020-01-31
creator: Goulis Helen (AA) @la
creator: Γουλή Ελένη (ΑΑ)
broader: Πληροφοριακά αντικείμενα
in scheme: HUMANITIES-THESAURUS
status: Εκδοθείς
notation: 2297
source: Artaud 1992
source: Sidiropoulou 2011
modified: 2020-10-12

Πληροφοριακά αντικείμενα
type: Concept
notation: 240
preferred label: Information objects @en
narrower: Θέατρο της σκληρότητας