HUMANITIES-THESAURUS
type: ConceptScheme

Φρούραρχος (περίοδος πόλης-κράτους)
type: Concept
contributor: Κατσιαδάκη Ελένη (ΑΑ)
contributor: Katsiadakis Helen (AA) @en
broader: Πολιτικά αξιώματα
in scheme: HUMANITIES-THESAURUS
status: Εκδοθείς
preferred label: Phrourarchos (city-state period) @en
source: Ραμού-Χαψιάδη 2007a
scope note: Αξίωμα που απαντά στην αρχαία Αθήνα. Ο φρούραρχος ήταν ο επικεφαλής της φρουράς τον οποίο οι Αθηναίοι εγκαθιστούσαν στις συμμαχικές πόλεις προκειμένου να ασκήσουν την κυριαρχία τους.
scope note: An office that appears in ancient Athens. Phrourarchos was the commander of the garrisons established by the Athenians in allied cities in order to exercise their authority over them. @en
created: 2020-01-31
related: Επίσκοπος (περίοδος πολης-κράτους)
modified: 2020-06-08
creator: Chrysovitsanos Gerasimos (AA) @fr
creator: Χρυσοβιτσάνος Γεράσιμος (ΑΑ)
notation: 2289

Πολιτικά αξιώματα
type: Concept
notation: 1696
preferred label: Political offices @en
narrower: Φρούραρχος (περίοδος πόλης-κράτους)

Επίσκοπος (περίοδος πολης-κράτους)
type: Concept
notation: 2200
preferred label: Episkopos (city-state period) @en
related: Φρούραρχος (περίοδος πόλης-κράτους)