HUMANITIES-THESAURUS
type: ConceptScheme

Χορογραφία
type: Concept
status: Εκδοθείς
creator: Goulis Helen (AA) @la
creator: Γουλή Ελένη (ΑΑ)
scope note: Choreography is the art of designing and composing sequences of movements of physical bodies (or their depictions) and involves determining the pace, flow, structure, and execution of a piece of dance, or any other piece of rehearsed movement. @en
scope note: Χορογραφία είναι η τέχνη του σχεδιασμού και της σύνθεσης ακολουθιών κινήσεων φυσικών σωμάτων (ή απεικονίσεών τους) και περιλαμβάνει τον καθορισμό του ρυθμού, της ροής, της δομής και της εκτέλεσης ενός κομματιού χορού, ή οποιουδήποτε άλλου έργου.
contributor: Βερναρδάκη Ελένη (ΑΑ)
contributor: Vernardaki Eleni (AA) @fr
notation: 2207
preferred label: Choreografie @de
preferred label: Chorégraphie @fr
preferred label: Choreography @en
broader: Χορός (τέχνη)
created: 2019-12-31
in scheme: HUMANITIES-THESAURUS
modified: 2020-10-06
source: Cohen 2015

Χορός (τέχνη)
type: Concept
notation: 1701
preferred label: Dance (art) @en
narrower: Χορογραφία