HUMANITIES-THESAURUS
type: ConceptScheme

Πρεμιέρες
type: Concept
source: Λεξικό της κοινής νεοελληνικής 1998
modified: 2020-10-12
notation: 2206
preferred label: Premieres @en
preferred label: Premières @fr
preferred label: Premiere @de
creator: Γουλή Ελένη (ΑΑ)
creator: Goulis Helen (AA) @de
contributor: Katsiadakis Helen (AA) @en
contributor: Κατσιαδάκη Ελένη (ΑΑ)
in scheme: HUMANITIES-THESAURUS
created: 2019-12-31
scope note: A premiere is the first public performance or showing of a play or film, dance, or musical composition and more generally an organised spectacle. @en
scope note: H πρώτη δημόσια παράσταση ενός καλλιτεχνικού έργου (θεατρικού, μουσικού, χορευτικού) ή προβολή ταινίας και γενικότερα ενός οργανωμένου θεάματος ή ακροάματος.
status: Εκδοθείς
broader: Γεγονότα - συμβάντα

Γεγονότα - συμβάντα
type: Concept
notation: 20
preferred label: Events @en
narrower: Πρεμιέρες