HUMANITIES-THESAURUS
type: ConceptScheme

Επιγραφές αθλητικών αγώνων
type: Concept
notation: 978
preferred label: Athletic games inscriptions @en
narrower: Ψηφίσματα αναγνώρισης αθλητικών αγώνων

Ψηφίσματα (Επιγραφές δημοσίου χαρακτήρα)
type: Concept
notation: 742
preferred label: Decrees (Public inscriptions) @en
related: Ψηφίσματα αναγνώρισης αθλητικών αγώνων

Ψηφίσματα αναγνώρισης αθλητικών αγώνων
type: Concept
in scheme: HUMANITIES-THESAURUS
modified: 2020-04-28
creator: Χρυσοβιτσάνος Γεράσιμος (ΑΑ)
creator: Chrysovitsanos Gerasimos (AA) @fr
status: Εκδοθείς
source: Κουμανούδης & Ματθαίου 1986
preferred label: Αthletic games recognition decrees @en
contributor: Κατσιαδάκη Ελένη (ΑΑ)
contributor: Katsiadakis Helen (AA) @en
created: 2019-12-18
broader: Επιγραφές αθλητικών αγώνων
notation: 2194
scope note: Inscriptions recording decrees by which a local athletic game in an area of ​​ancient Greece, is recognized as Panhellenic. Such recognition meant enhancing the city's prestige both financially and diplomatically. @en
scope note: Επιγραφές που καταγράφουν ψηφίσματα με τα οποία ένας αθλητικός αγώνας, με τοπικό χαρακτήρα σε μια περιοχή της αρχαίας Ελλάδας, αναγνωρίζεται ως πανελλήνιος. Μια τέτοια αναγνώριση σήμαινε ενίσχυση του κύρους της πόλης τόσο σε οικονομικό όσο και σε διπλωματικό επίπεδο.
related: Ψηφίσματα (Επιγραφές δημοσίου χαρακτήρα)