Κινητά αντικείμενα
type: Concept
notation: 24
preferred label: Mobile objects @en
narrower: Κοστούμια (Παραστατικές τέχνες)

HUMANITIES-THESAURUS
type: ConceptScheme

Σκηνικά αντικείμενα
type: Concept
notation: 2177
preferred label: Props @en
preferred label: Requisiten @de
preferred label: Accessoires @fr
related: Κοστούμια (Παραστατικές τέχνες)

Κοστούμια (Παραστατικές τέχνες)
type: Concept
contributor: Vernardaki Eleni (AA) @de
contributor: Βερναρδάκη Ελένη (ΑΑ)
source: Holt 2001
source: Παντουβάκη 2010
related: Ενδυματολογία
related: Σκηνικά αντικείμενα
status: Εκδοθείς
modified: 2020-10-06
preferred label: Costumes (Arts du spectacle) @fr
preferred label: Costumes (Performing arts) @en
preferred label: Kostüme (Darstellende Künste) @de
creator: Goulis Helen (AA) @la
creator: Γουλή Ελένη (ΑΑ)
scope note: Κοστούμι είναι το ένδυμα ενός ηθοποιού/ερμηνευτή που αναπαριστά ένα δραματικό πρόσωπο στη σκηνή του θεάτρου, τον κινηματογράφο ή την τηλεόραση. Το θεατρικό κοστούμι προσδιορίζει τον χαρακτήρα που υποδύεται ο ηθοποιός στον χώρο και τον χρόνο της θεατρικής πράξης. Σηματοδοτεί την κοινωνική υπόσταση και την ψυχολογική κατάστασή του, ενώ παράλληλα υπογραμμίζει τη δραματουργική του θέση και την εσωτερική σχέση των χαρακτήρων μιας παράστασης. Τα κοστούμια δίνουν άμεσες ενδείξεις ηλικίας, φύλου, επαγγέλματος ή κοινωνικής ένταξης, του τόπου και του χρόνου στον οποίο αναφέρεται η θεατρική δράση. Ολοκληρώνονται μόνο με την παρουσίασή τους στο κοινό διαμορφώνοντας ένα παράλληλο, οπτικό, αφηγηματικό επίπεδο που συμπληρώνει τον λόγο και την κίνηση του ηθοποιού.
scope note: Costume is the dress of an actor/performer who represents a character on stage, or in film or television. The theatrical costume defines the character the actor impersonates in the place and time of the dramatic action. It signifies their social status and psychological state, while at the same time emphasising the dramatic position and the internal relationship of the characters of a performance. Costumes give the spectator explicit information about age, gender, profession or social class, the place and time of the action. They are not a complete whole unless presented to the audience, creating a parallel, visual narrative plane that complements the actor’s words and movements. @en
created: 2019-11-30
broader: Κινητά αντικείμενα
in scheme: HUMANITIES-THESAURUS
notation: 2175

Ενδυματολογία
type: Concept
notation: 822
preferred label: Costume design @en
preferred label: Kostümbild @de
preferred label: Design de costumes @fr
related: Κοστούμια (Παραστατικές τέχνες)