HUMANITIES-THESAURUS
type: ConceptScheme

Γραφή αλογίου
type: Concept
modified: 2020-10-19
scope note: A legal procedure that occured in ancient Athens. Archons who did not provide financial accounts (logoi), upon the termination of their office for the public money they managed, were publicly prosecuted by means of the graphe alogiou. @en
scope note: Διαδικασία νομικής φύσεως που απαντά στην αρχαία Αθήνα. Με τη γραφή αλογίου ασκούνταν δίωξη με δημόσια αγωγή σε άρχοντες που δεν απέδιδαν οικονομικούς απολογισμούς (λόγους), με το πέρας της θητείας τους, για τα δημόσια χρήματα που διαχειρίζονταν.
creator: Χρυσοβιτσάνος Γεράσιμος (ΑΑ)
creator: Chrysovitsanos Gerasimos (AA) @fr
broader: Γραφή
contributor: Κατσιαδάκη Ελένη (ΑΑ)
contributor: Katsiadakis Helen (AA) @en
notation: 2168
status: Εκδοθείς
created: 2019-11-28
in scheme: HUMANITIES-THESAURUS
source: Glotz 1994
preferred label: Graphe alogiou @en

Γραφή
type: Concept
notation: 2167
preferred label: Graphe @en
narrower: Γραφή αλογίου