Συλλογικότητες και ομάδες
type: Concept
notation: 26
preferred label: Collectivities and groups @en
narrower: Μητρόξενοι

Μητρόξενοι
type: Concept
creator: Chrysovitsanos Gerasimos (AA) @fr
creator: Χρυσοβιτσάνος Γεράσιμος (ΑΑ)
contributor: Κατσιαδάκη Ελένη (ΑΑ)
contributor: Katsiadakis Helen (AA) @en
preferred label: Mitroxenoi @en
created: 2019-10-07
source: Glotz 1994
source: Liddell & Scott 1940
in scheme: HUMANITIES-THESAURUS
scope note: Όρος που χρησιμοποιούνταν στην αρχαία Ελλάδα για τα παιδιά που είχαν γεννηθεί από ξένη μητέρα. Οι μητρόξενοι είχαν τα πλήρη πολιτικά δικαιώματα όπως οι πολίτες με γηγενείς γονείς. Στην αρχαία Αθήνα αυτό έπαψε να ισχύει καθώς, με την ψήφιση νόμου το 451/0 π.Χ., μέτρο που αποδίδεται στον Περικλή, Aθηναίοι πολίτες θεωρούνταν μόνο όσοι είχαν και τους δύο γονείς Aθηναίους.
scope note: A term used in ancient Greece for children born to a foreign mother. The mitroxenoi had full political rights as citizens with indigenous parents. In ancient Athens, this was ceased by the enforcement of a law voted in 451/0 BC, a measure attributed to Pericles, by which Athenian citizens were considered only those who had both Athenian parents. @en
status: Εκδοθείς
broader: Συλλογικότητες και ομάδες
notation: 2075
modified: 2020-04-28

HUMANITIES-THESAURUS
type: ConceptScheme