HUMANITIES-THESAURUS
type: ConceptScheme

Τόνος (Ζωγραφική)
type: Concept
status: Εκδοθείς
modified: 2020-10-11
notation: 2018
preferred label: Tone @en
broader: Προτασιακά αντικείμενα
contributor: Daskalothanasis Nikos (ASFA) @de
contributor: Δασκαλοθανάσης Νίκος (ΑΣΚΤ)
created: 2019-09-15
in scheme: HUMANITIES-THESAURUS
creator: Chatzi Maria (ASFA) @en
creator: Χατζή Μαρία (ΑΣΚΤ)
source: Tate n.d.
scope note: Variations of color produced by changes in intensity or value. @en
scope note: Οι διαφοροποιήσεις της φωτεινής ποιότητας του χρώματος που παράγονται από τη μεταβολή της έντασής του.

Προτασιακά αντικείμενα
type: Concept
notation: 25
preferred label: Propositional objects @en
narrower: Τόνος (Ζωγραφική)