HUMANITIES-THESAURUS
type: ConceptScheme

Μετανάστευση
type: Concept
notation: 1989
preferred label: Migration @en
narrower: Αποικισμός

Αποικισμός
type: Concept
source: Manning 2013
creator: Tzedopoulos Giorgos (AA) @en
creator: Τζεδόπουλος Γιώργος (ΑΑ)
scope note: Μετακίνηση ατόμων από μια κοινότητα προκειμένου να ιδρύσουν μια νέα κοινότητα, σε αναδιπλασιασμό της αρχικής. Συνήθως οι αποικιστές εγκαθίστανται σε περιβάλλον παρόμοιο με εκείνο της αρχικής τους κοινότητας, και επομένως διατηρούν τον ίδιο τρόπο ζωής. Ο αποικισμός συμβαίνει περιστασιακά, ιδίως σε κοινότητες που ακμάζουν. Οι άποικοι εγκαθίστανται και ξεκινούν καινούργιες κοινότητες χωρίς να χρειάζεται να μάθουν νέες γλώσσες και έθιμα.
scope note: Departure of individuals from one community to establish a new community that replicates the home community. Usually, the colonists settle in an environment very similar to that of their home community, and thereby maintain the same style of life. Colonisation takes place occasionally, especially in cases of communities that are thriving. The colonists settle and begin new communities without having to learn new languages or customs. @en
preferred label: Colonisation @en
contributor: Katsiadakis Helen (AA) @en
contributor: Κατσιαδάκη Ελένη (ΑΑ)
status: Εκδοθείς
in scheme: HUMANITIES-THESAURUS
broader: Μετανάστευση
notation: 1991
modified: 2019-11-07
created: 2019-09-06