Θεσμοθέτης (περίοδος πόλης-κράτους)
type: Concept
scope note: An office that first appears in ancient Athens. Α a member of the college of six Thesmothetai. His duties were mainly of a legal nature. He was responsible for several kinds of cases. Also, he determined the time and the location where the courts would be in session. @en
scope note: Αξίωμα που απαντά στην αρχαία Αθήνα. Μέλος του σώματος των έξι Θεσμοθετών. Τα καθήκοντά του ήταν κυρίως νομικής φύσεως. Ήταν υπεύθυνος για την εκδίκαση διαφόρων ειδών υποθέσεων. Επίσης, καθόριζε τον τόπο και τον χρόνο των συνεδριάσεων των δικαστηρίων.
related: Άρχων (περίοδος πόλης-κράτους)
related: Γραφή παρανόμων
modified: 2020-04-06
creator: Χρυσοβιτσάνος Γεράσιμος (ΑΑ)
creator: Chrysovitsanos Gerasimos (AA) @fr
source: Aristotelis 1920
source: MacDowell 1970b
preferred label: Thesmothetis (city-state period) @en
notation: 1956
in scheme: HUMANITIES-THESAURUS
contributor: Katsiadakis Helen (AA) @en
contributor: Κατσιαδάκη Ελένη (ΑΑ)
created: 2019-08-28
status: Εκδοθείς
broader: Πολιτικά αξιώματα

Άρχων (περίοδος πόλης-κράτους)
type: Concept
notation: 1985
preferred label: Archon (city-state period) @en
related: Θεσμοθέτης (περίοδος πόλης-κράτους)

Γραφή παρανόμων
type: Concept
notation: 1862
preferred label: Graphe paranomon @en
related: Θεσμοθέτης (περίοδος πόλης-κράτους)

HUMANITIES-THESAURUS
type: ConceptScheme

Πολιτικά αξιώματα
type: Concept
notation: 1696
preferred label: Political offices @en
narrower: Θεσμοθέτης (περίοδος πόλης-κράτους)