HUMANITIES-THESAURUS
type: ConceptScheme

Methods
type: Concept
notation: 31
preferred label: Μέθοδοι @el
narrower: Play within a play

Play within a play
type: Concept
broader: Methods
contributor: Κατσιαδάκη Ελένη (ΑΑ) @el
contributor: Katsiadakis Helen (AA)
preferred label: Τéâtre dans le théâtre @fr
preferred label: Θέατρο εν θεάτρω @el
preferred label: Theater im Theater @de
scope note: Τεχνική του δράματος δια της οποίας ένα στοιχείο ή ένα σύνολο στοιχείων (προσώπων, ενεργειών, καταστάσεων), που εμφανίζεται σχετικώς ανεξαρτητοποιημένο από τα υπόλοιπα στοιχεία του έργου, γίνεται αντικείμενο του βλέμματος των επί σκηνής θεατών, δηλαδή των ηθοποιών που υποδύονται τους θεατές, την ίδια στιγμή που αυτοί είναι αντικείμενο του βλέμματος των πραγματικών θεατών. @el
scope note: Dramatic device by which an element or a set of elements (persons, actions, situations) appearing relatively detached from the rest of the play, become the object of the spectator’s gaze on-stage, i.e. of the actors impersonating the spectators, while at the same time they themselves are watched by the audience.
status: Εκδοθείς
creator: Γουλή Ελένη (ΑΑ) @el
creator: Goulis Helen (AA)
created: 2015-10-30
source: Fischer & Greiner 2007
source: Couty & Rey 1992
source: Πεφάνης 1999
in scheme: HUMANITIES-THESAURUS
notation: 195
modified: 2019-02-12