Ναυμαχίες
type: Concept
contributor: Katsiadakis Helen (AA) @de
contributor: Κατσιαδάκη Ελένη (ΑΑ)
modified: 2020-04-02
status: Εκδοθείς
source: Sondhaus 2001
created: 2019-07-16
creator: Τζεδόπουλος Γιώργος (ΑΑ)
creator: Tzedopoulos Giorgos (AA) @de
scope note: Ένοπλες συγκρούσεις μεταξύ αντιμαχομένων δυνάμεων που λαμβάνουν χώρα σε υδάτινη επιφάνεια, συνήθως θαλάσσια, και στις οποίες χρησιμοποιούνται κυρίως (αλλά όχι αποκλειστικά) πλωτά πολεμικά μέσα. Οι ναυμαχίες διεξάγονται στο πλαίσιο ιδιαίτερων τακτικών σχεδιασμών που προσιδιάζουν στο υδάτινο περιβάλλον (ναυτικός πόλεμος).
scope note: Armed conflicts between opposing forces that take place on the water, mostly on the sea, and in which mainly (but not exclusively) waterborne military means are employed. Naval battles are conducted in the framework of particular tactical planning that applies to the water environment (naval warfare). @en
preferred label: Naval battles @en
notation: 1854
in scheme: HUMANITIES-THESAURUS
broader: Πολεμικά γεγονότα

HUMANITIES-THESAURUS
type: ConceptScheme

Πολεμικά γεγονότα
type: Concept
notation: 1852
preferred label: War events @en
narrower: Ναυμαχίες