HUMANITIES-THESAURUS
type: ConceptScheme

Φάρσα
type: Concept
scope note: Δημοφιλές δραματουργικό υποείδος της κωμωδίας, όπου πρυτανεύει ο καταιγιστικός ρυθμός, με τους αποπροσωποποιημένους τύπους να λειτουργούν έξω από κάθε κοινωνική καταγωγή ή ιδεολογία, καταπατώντας συχνά λογική και αληθοφάνεια και αποκλείοντας τη συναισθηματική μέθεξη ή την ψυχολογική εμβάθυνση. Η φάρσα έχει περιορισμένη έκταση, αυστηρή γεωμετρική δομή, στον πυρήνα της ένα σχέδιο εξαπάτησης με σκοπό κάποιο υλικό ή ερωτικό όφελος και πρωταρχικά συστατικά την υποτυπώδη πλοκή, τις ανατροπές, τα απροσδόκητα συμβάντα, τις παρανοήσεις, τις μεταμφιέσεις, την αλλαγή ρόλων, την εξωφρενική υπερβολή, τα χονδροειδή αστεία, τις αφελείς ατάκες, τα λογοπαίγνια και την τολμηρή γλώσσα με σεξουαλικά υπονοούμενα. Σε επίπεδο σκηνικής πρακτικής, το είδος χαρακτηρίζεται από την έντονη σωματική έκφραση του ηθοποιού με μιμική, γκριμάτσες και χειρονομίες.
scope note: Popular dramatic subgenre of comedy dominated by the rapid-fire pace with the depersonalised types operating outside of any social background or ideology, often violating logic and verisimilitude, and excluding emotional involvement or psychological deepening. Farce is of limited length, has a strict geometric structure, at its core a deception plan for the purpose of some material or erotic benefit. Its basic elements are the rudimentary plot, the twists, the unexpected events, the misunderstandings, the disguises, the change of roles, the extravagant exaggeration, the gross jokes, the naive lines, the puns and the language with sexual innuendoes. In terms of stage practice, the genre is characterised by the actor's intense physical expression with mimicry, grimaces, and gestures. @en
contributor: Vernardaki Eleni (AA) @fr
contributor: Βερναρδάκη Ελένη (ΑΑ)
created: 2019-06-28
creator: Goulis Helen (AA) @la
creator: Γουλή Ελένη (ΑΑ)
in scheme: HUMANITIES-THESAURUS
notation: 1805
preferred label: Farce @fr
broader: Κωμωδία
source: ΕΛ.ΓΟΥ, Λεξικό 2007
source: Μπακονικόλα 2001
source: Corvin 2008
modified: 2020-10-06
status: Εκδοθείς

Κωμωδία
type: Concept
notation: 804
preferred label: Comédie @fr
preferred label: Comedy @en
preferred label: Komödie @de
narrower: Φάρσα