HUMANITIES-THESAURUS
type: ConceptScheme

Άγγελος
type: Concept
creator: Γουλή Ελένη (ΑΑ)
creator: Goulis Helen (AA) @la
preferred label: Bote @de
preferred label: Messager @fr
preferred label: Messenger @en
contributor: Κατσιαδάκη Ελένη (ΑΑ)
contributor: Katsiadakis Helen (AA) @en
broader: Ρόλοι (θέατρο)
notation: 1797
source: Dickin (2009)
source: De Jong (1991)
source: Barrett (2002)
modified: 2020-11-02
created: 2019-06-28
in scheme: HUMANITIES-THESAURUS
scope note: Δευτερεύον πρόσωπο της αρχαίας τραγωδίας, συνήθως ανώνυμο, βασική λειτουργία του οποίου είναι να μεταφέρει γεγονότα που συνέβησαν εκτός σκηνής ή μέσα στο παλάτι και των οποίων έχει υπάρξει αυτόπτης μάρτυς σε άλλα δραματικά πρόσωπα και τους θεατές.
scope note: Secondary figure of ancient Greek tragedy, usually anonymous. The basic function of the Messenger in the drama is to report off-stage action or events that occurred inside the palace which he has eye-witnessed to other characters on stage and the spectators. @en
status: Εκδοθείς
related: Αρχαία ελληνική τραγωδία
alternative label: Αγγελιαφόρος

Ρόλοι (θέατρο)
type: Concept
notation: 625
preferred label: Roles @en
preferred label: Rolle @de
preferred label: Rôles @fr
narrower: Άγγελος

Αρχαία ελληνική τραγωδία
type: Concept
notation: 1291
preferred label: Ancient Greek tragedy @en
preferred label: Tragédie grecque antique @fr
related: Άγγελος