HUMANITIES-THESAURUS
type: ConceptScheme

Μέθοδοι
type: Concept
notation: 31
preferred label: Methods @en
narrower: Αναγνώριση (θέατρο)

Αναγνώριση (θέατρο)
type: Concept
scope note: Essential part of the plot of a tragedy according to Aristotle, anagnorisis (recognition) -already known from the Homeric epics- defines the transition of the tragic hero from ignorance to knowledge through a sudden revelation. This procedure results in the awareness of the true nature of their situation, or that of the others and the discovery of their identity– leading to the resolution of the drama. In classical and contemporary dramaturgy, it constitutes a dramaturgical technique where a character is recongised by another and the conflict is resolved. @en
scope note: Βασικό στοιχείο της τραγωδίας κατά τον Αριστοτέλη, γνωστό ήδη από τα ομηρικά έπη, η αναγνώριση συνιστά τη μετάβαση του τραγικού ήρωα από την άγνοια στη γνώση, μέσω μιας αιφνίδιας αποκάλυψης. Η διαδικασία αυτή συνεπάγεται τη συνειδητοποίηση της αληθινής φύσης της κατάστασής του ή άλλων δραματικών προσώπων και την ανακάλυψη της ταυτότητάς του, οδηγώντας στη λύση του δράματος. Στην κλασική και νεότερη δραματουργία αποτελεί τεχνική κατά την οποία ένα δραματικό πρόσωπο αναγνωρίζεται από ένα άλλο, γεγονός που επιλύει τη σύγκρουση.
preferred label: Anagnorisis @de
status: Εκδοθείς
creator: Goulis Helen (AA) @fr
creator: Γουλή Ελένη (ΑΑ)
source: Russo 2013
source: Cave 1990
source: Kennedy and Lawrence 2008
contributor: Κατσιαδάκη Ελένη (ΑΑ)
contributor: Katsiadakis Helen (AA) @en
notation: 1796
alternative label: Wiedererkennen (Theater) @de
alternative label: Recognition (theatre) @en
alternative label: Reconnaissance (théâtre) @fr
in scheme: HUMANITIES-THESAURUS
modified: 2020-09-30
created: 2019-06-28
broader: Μέθοδοι