Συγγραφεύς (περίοδος πόλης-κράτους)
type: Concept
modified: 2019-10-27
scope note: Αξίωμα που απαντά στην αρχαία Αθήνα. Ένα μεμονωμένο άτομο είτε ομάδα ατόμων (ως ειδική επιτροπή Συγγραφέων) διοριζόταν από την Εκκλησία του Δήμου με σκοπό τη σύνταξη οικονομοτεχνικής μελέτης (ή συγγραφής, όπως ονομαζόταν) για την εκτέλεση ενός δημόσιου έργου.
scope note: An office that appears in ancient Athens. A person or a committee (as a special committee of syngrapheis) appointed by the Assembly to prepare a financial and technical study (syngraphe, as it was called) of public work. @en
related: Συγγραφείς (περίοδος πόλης-κράτους)
related: Συγγραφές (περίοδος πόλης-κράτους)
preferred label: Syngrapheys (city-state period) @en
source: Ζαββού 2007
created: 2019-06-24
creator: Chrysovitsanos Gerasimos (AA) @fr
creator: Χρυσοβιτσάνος Γεράσιμος (ΑΑ)
contributor: Κατσιαδάκη Ελένη (ΑΑ)
contributor: Katsiadakis Helen (AA) @en
in scheme: HUMANITIES-THESAURUS
status: Εκδοθείς
notation: 1778
broader: Πολιτικά αξιώματα

Συγγραφείς (περίοδος πόλης-κράτους)
type: Concept
notation: 1767
preferred label: Syngrapheis (city-state period) @en
related: Συγγραφεύς (περίοδος πόλης-κράτους)

Συγγραφές (περίοδος πόλης-κράτους)
type: Concept
notation: 1777
preferred label: Syngraphai (city-state period) @en
related: Συγγραφεύς (περίοδος πόλης-κράτους)

HUMANITIES-THESAURUS
type: ConceptScheme

Πολιτικά αξιώματα
type: Concept
notation: 1696
preferred label: Political offices @en
narrower: Συγγραφεύς (περίοδος πόλης-κράτους)