HUMANITIES-THESAURUS
type: ConceptScheme

Μεβλεβήδες
type: Concept
creator: Τζεδόπουλος Γιώργος (ΑΑ)
creator: Tzedopoulos Giorgos (AA) @de
scope note: Members of one of the most well known Sufi orders, due to its famous characteristic "whirling" meditative dance. It takes its name from the great 13th-century mystic poet Jalal al-din Rumi, who is known in Turkish as Mevlana (from the Arabic mawlana = “our master”). Though Rumi’s poetry was composed in Persian, the language of the Seljuk court, the order developed mostly in the Turkish environment of the Ottoman Empire, where it benefited from the patronage of Ottoman sultans. Mevlevi dervishes studied and produced art in their worship centres (tekkes). The order in general appealed to the upper classes and the intellectuals, and many Ottoman poets, composers, and calligraphers were Mevlevis. @en
scope note: Μέλη ενός από τα γνωστότερα σουφικά τάγματα λόγω του περίφημου "στροβιλιζόμενου" χορού, μιας πρακτικής λατρείας και διαλογισμού. Το όνμά τους προέρχεται από τον μεγάλο μυστικιστή ποιητή του 13ου αιώνα Τζαλαλεντίν Ρουμί, ο οποίος είναι γνωστός στα τουρκικά ως Μεβλανά (από το περσικό mawlana = “ο κύριός μας”). Αν και η ποίηση του Ρουμί συντέθηκε στα περσικά, γλώσσα της σελτζουκικής αυλής, το τάγμα αναπτύχθηκε κυρίως στο τουρκικό περιβάλλον της Οθωμανικής Αυτοκρατορίας, όπου επωφελήθηκε από την προστασία των οθωμανών σουλτάνων. Οι Μεβλεβήδες μελετούσαν και ανέπτυσσαν καλλιτεχνική δραστηρότητα στα λατρευτικά τους κέντρα (τεκέδες). Τα μέλη του τάγματος προέρχονταν μάλλον από τις ανώτερες τάξεις και τους λογίους, και πολλοί οθωμανοί ποιητές, συνθέτες και καλλιγράφοι ήταν μέλη του τάγματος.
status: Εκδοθείς
contributor: Katsiadakis Helen (AA) @en
contributor: Κατσιαδάκη Ελένη (ΑΑ)
created: 2019-06-24
preferred label: Mevlevis @en
source: Martin 2016
source: Campo 2009
in scheme: HUMANITIES-THESAURUS
modified: 2020-04-02
broader: Μουσουλμανικές θρησκευτικές κοινότητες
notation: 1771

Μουσουλμανικές θρησκευτικές κοινότητες
type: Concept
notation: 627
preferred label: Muslim religious communities @en
narrower: Μεβλεβήδες