HUMANITIES-THESAURUS
type: ConceptScheme

Αυτοκράτορας
type: Concept
preferred label: Emperor @en
contributor: Katsiadakis Helen (AA) @en
contributor: Κατσιαδάκη Ελένη (ΑΑ)
scope note: The ruler of an empire, a state with a large territory and expansionary claims that rules over peoples and populations that differ in ethnic, religious and cultural terms. The emperor embodies the state's claims to universal domination and is regarded superior in status to other monarchs and rulers, such as kings. More often than not, emperors belong to a dynasty, which, in the case of the Ottoman Empire, may be identified with the state itself, while in other traditions, like the Roman one, the ascension of the emperor to power either is not inscribed in dynastic structures or does not depend only on dynastic continuity. @en
scope note: Μονάρχης που ηγείται μιας αυτοκρατορίας, κράτους με ευρεία έκταση και επεκτατικές αξιώσεις που κυριαρχεί σε εθνοτικά, θρησκευτικά και πολιτισμικά διαφορετικούς λαούς και πληθυσμούς. Ο αυτοκράτορας ενσαρκώνει τις κοσμοκρατορικές αξιώσεις του κράτους και θεωρείται υπέρτερος σε κύρος από άλλους μονάρχες και ηγέτες, όπως οι βασιλείς. Συνήθως ο αυτοκράτορας ανήκει σε μια δυναστεία, η οποία, όπως στην περίπτωση της Οθωμανικής Αυτοκρατορίας, μπορεί να ταυτίζεται με το ίδιο το κράτος, ενώ σε άλλες παραδόσεις, όπως η ρωμαϊκή, η ανάδειξη του αυτοκράτορα είτε δεν εντάσσεται σε δυναστικές δομές είτε δεν εξαρτάται μόνον από τη δυναστική συνέχεια.
notation: 1754
status: Εκδοθείς
creator: Τζεδόπουλος Γιώργος (ΑΑ)
creator: Tzedopoulos Giorgos (AA) @de
created: 2019-06-12
broader: Πολιτικά αξιώματα
in scheme: HUMANITIES-THESAURUS
source: Burbank & Cooper 2010
modified: 2019-11-07

Πολιτικά αξιώματα
type: Concept
notation: 1696
preferred label: Political offices @en
narrower: Αυτοκράτορας