HUMANITIES-THESAURUS
type: ConceptScheme

Πολιτικά αξιώματα
type: Concept
notation: 1696
preferred label: Political offices @en
narrower: Πρόεδρος της Δημοκρατίας

Πρόεδρος της Δημοκρατίας
type: Concept
preferred label: President of the Republic @en
scope note: The highest political office in nation states with a regime of presidential or parliamentary republic. In presidential republics (as the USA) and semi-presidential republics (as France), the president is elected through general elections and is the head of state and the head of the executive at the same time. In parliamentary republics, executive power rests with the prime minister and his/her cabinet, while the president is elected by parliament as the head of state, but his/her functions are rather ceremonial, in accordance with those of the king/queen in constitutional monarchies. @en
scope note: Ύψιστο πολιιτκό αξίωμα στα εθνικά κράτη με πολίτευμα προεδρικής ή κοινοβουλευτικής δημοκρατίας. Στις προεδρικές (όπως οι ΗΠΑ) και ημι-προεδρικές (όπως η Γαλλία) δημοκρατίες, ο/η πρόεδρος εκλέγεται με γενικές εκλογές και είναι παράλληλα επικεφαλής του κράτους και επικεφαλής της εκτελεστικής εξουσίας. Στις κοινοβουλευτικές δημοκρατίες, φορέας της εκτελεστικής εξουσίας είναι ο/η πρωθυπουργός και το υπουργικό συμβούλιο. Ο/η πρόεδρος εκλέγεται από το κοινοβούλιο και είναι επικεφαλής του κράτους, αλλά οι λειτουργίες του/της είναι κυρίως εθιμοτυπικές, καθώς θεωρείται πως ενσαρκώνει την ενότητα του κράτους με τρόπο αντίστοιχο με εκείνον των βασιλέων στις συνταγματικές μοναρχίες.
modified: 2019-07-17
in scheme: HUMANITIES-THESAURUS
created: 2019-06-12
notation: 1752
contributor: Κατσιαδάκη Ελένη (ΑΑ)
contributor: Katsiadakis Helen (AA) @en
status: Εκδοθείς
broader: Πολιτικά αξιώματα
creator: Τζεδόπουλος Γιώργος (ΑΑ)
creator: Tzedopoulos Giorgos (AA) @la
source: Riggs 1997