Ιμαμίτες
type: Concept
notation: 1748
preferred label: Imamiyyah Shiites @en
broader: Σιίτες

HUMANITIES-THESAURUS
type: ConceptScheme

Μουσουλμανικές θρησκευτικές κοινότητες
type: Concept
notation: 627
preferred label: Muslim religious communities @en
narrower: Σιίτες

Ισμαηλίτες (κλάδος του σιιτισμού)
type: Concept
notation: 2338
preferred label: Ismailis (Shia branch) @en
broader: Σιίτες

Σιίτες
type: Concept
narrower: Ιμαμίτες
narrower: Ισμαηλίτες (κλάδος του σιιτισμού)
status: Εκδοθείς
contributor: Katsiadakis Helen (AA) @en
contributor: Κατσιαδάκη Ελένη (ΑΑ)
in scheme: HUMANITIES-THESAURUS
scope note: Οriginally the ‘‘partisans’’ of Ali, Muhammad’s cousin and husband of the Prophet’s daughter, Fatima. Today, however, the term designates a number of distinct groups that have arisen over the course of Islamic history and which are united by a belief that the leader of the Muslim community should be a member of the Prophet’s family, and that this continuity in leadership is expressed through the line of the legitimate Muslim imams, distinct from the Sunni caliphs. Taken together, the Shiites represent more than 10 percent of the world's Muslim population. @en
scope note: Αρχικά οι "οπαδοί" του Αλή, εξαδέλφου του Μωάμεθ και συζύγου της κόρης του Φατιμά. Σήμερα ο όρος χαρακτηρίζει ένα σύνολο διακριτών ομάδων που αναδύθηκαν στην ιστορική πορεία του Ισλάμ, και που συμφωνούν ότι ο ηγέτης της μουσουλμανικής κονότητας πρέπει να είναι μέλος της οικογένειας του προφήτη και ότι αυτή η ηγετική συνέχεια έχει εκφραστεί μέσω της γραμμής των νόμιμων ιμάμηδων του Ισλάμ, οι οποίοι είναι διάφοροι από τους σουνίτες χαλίφες. Στο σύνολό τους οι Σιίτες αποτελούν σήμερα πάνω από το 10% των μουσουλμάνων παγκοσμίως.
created: 2019-06-04
preferred label: Shiites @en
notation: 1747
broader: Μουσουλμανικές θρησκευτικές κοινότητες
creator: Tzedopoulos Giorgos (AA) @de
creator: Τζεδόπουλος Γιώργος (ΑΑ)
modified: 2020-04-02
source: Martin 2016
source: Campo 2009