HUMANITIES-THESAURUS
type: ConceptScheme

Δρούζοι
type: Concept
preferred label: Druzes @en
scope note: Ethnoreligious group of the Near East. The Druzes are a particularly divergent branch of Shia Ismailism that originates in the dynasty of the Fatimids in medieval Egypt, and specifically in the reign of the caliph al-Ḥakim bi-Amr Allah, who is considered by them by as an incarnation of God. The formation of an extreme unitarian version of Ismailism by Hamza al-Zawzani, which rejected some of the most widely accepted Islamic practices, led to persecutions against his followers. The latter were confined to Syria and, mainly, to Mount Lebanon, where the Druzes were formed as an ethnoreligious group based on a tribal social structure. During the 19th century, and in the context of the European Powers' intervention and competition, a part of the Druzes committed massacres against the Maronite Christians. European intervention led to the creation of the state of Lebanon. The Druzes are a vital part of Lebanese society and politics. @en
scope note: Εθνοθρησκευτική ομάδα της Εγγύς Ανατολής. Οι Δρούζοι αποτελούν έναν ιδιαίτερα αποκλίνοντα κλάδο του σιιτικού ισμαηλιτισμού, ο οποίος ανάγεται στην δυναστεία των Φατιμιδών στην Αίγυπτο των μέσων χρόνων, και συγκεκριμένα στη βασιλεία του χαλίφη Αλ-Χακίμ μπι-Αμρ Αλλάχ που θεωρείται από τους Δρούζους ενσάρκωση του Θεού. Η διαμόρφωση μιας ακραία μονιστικής εκδοχής του ισμαηλισμού από τον θεολόγο και ιεροκήρυκα Χαμζά αλ Ζαουζανί, η οποία απορρίπτει μερικές από τις πλέον διαδεδομένες ισλαμικές πρακτικές, οδήγησε στην εξαπόλυση διώξεων κατά των πιστών του, οι οποίοι περιορίστηκαν στη Συρία και κυρίως στο όρος του Λιβάνου. Εκεί οι Δρούζοι συγκροτήθηκαν ως εθνοθρησκευτική ομάδα με θεσμούς φυλετικής οργάνωσης. Στη διάρκεια του 19ου αιώνα, και στο πλαίσιο πολιτικών ανταγωνισμών και επεμβάσεων των ευρωπαϊκών Δυνάμεων, μέρος των Δρούζων πραγματοποίησαν σφαγές ενάντια στους μαρωνίτες χριστιανούς. Οι ευρωπαϊκές επεμβάσεις οδήγησαν στη δημιουργία του κράτους του Λιβάνου. Οι Δρούζοι αποτελούν συστατικό μέρος της κοινωνίας και του πολιτικού καθεστώτος της χώρας.
in scheme: HUMANITIES-THESAURUS
notation: 1745
status: Εκδοθείς
contributor: Βερναρδάκη Ελένη (ΑΑ)
contributor: Vernardaki Eleni (AA) @fr
creator: Tzedopoulos Giorgos (AA) @de
creator: Τζεδόπουλος Γιώργος (ΑΑ)
source: Bowering 2013
broader: Ισμαηλίτες (κλάδος του σιιτισμού)
modified: 2020-02-27
created: 2019-06-03

Ισμαηλίτες (κλάδος του σιιτισμού)
type: Concept
notation: 2338
preferred label: Ismailis (Shia branch) @en
narrower: Δρούζοι