HUMANITIES-THESAURUS
type: ConceptScheme

Δήμαρχος (περίοδος έθνους-κράτους)
type: Concept
contributor: Κατσιαδάκη Ελένη (ΑΑ)
contributor: Katsiadakis Helen (AA) @en
status: Εκδοθείς
notation: 1697
scope note: Το αξίωμα του δημάρχου, στη μοντέρνα χρήση του όρου, αναφέρεται στον επικεφαλής της δημοτικής διοίκησης. Ο δήμαρχος είναι κατά κανόνα ο πρόεδρος του δημοτικού συμβουλίου. Ασχέτως της μορφής της τοπικής διοίκησης, ο ρόλος του δημάρχου προσδιορίζεται από τη σχέση του με το συμβούλιο και με την κεντρική διοίκηση. Οι δήμαρχοι διορίζονται ή εκλέγονται. Μέχρι περίπου τα μέσα του 19ου αιώνα, οι δήμαρχοι στα ευρωπαϊκά κράτη κατά κανόνα διορίζονταν από την κεντρική κυβέρνηση. Με την άνοδο της αρχής της πολιτικής αντιπροσώπευσης, όλο και περισσότερα κράτη υιοθέτησαν την πρακτική της εκλογής του δημάρχου από τον τοπικό πληθυσμό.
scope note: The office of mayor, in modern usage, identifies the head of a municipal government. The mayor is almost invariably the chairman of the municipal council. Whatever the form of local government, the mayor’s role rests largely on his relationship to the council and to the central government. Mayors are either appointed or elected. In Europe, until about the middle of the 19th century, most mayors were appointed by the central government. With the rise of representative government, more and more countries adopted the practice of electing the mayor by the local population. @en
source: Encyclopaedia Britannica 2018 (Mayor)
modified: 2019-07-17
preferred label: Mayor @en
created: 2019-05-07
creator: Τζεδόπουλος Γιώργος (ΑΑ)
creator: Tzedopoulos Giorgos (AA) @de
in scheme: HUMANITIES-THESAURUS
broader: Πολιτικά αξιώματα

Πολιτικά αξιώματα
type: Concept
notation: 1696
preferred label: Political offices @en
narrower: Δήμαρχος (περίοδος έθνους-κράτους)