Ομοφωνία
type: Concept
modified: 2020-10-19
creator: Καρασίμος Αθανάσιος (ΑΑ)
creator: Karasimos Athanasios (AA) @en
status: Εκδοθείς
contributor: Katsiadakis Helen (AA) @en
contributor: Κατσιαδάκη Ελένη (ΑΑ)
source: Saeed 2017
source: Crystal 2008
preferred label: Homophony @en
notation: 1692
in scheme: HUMANITIES-THESAURUS
created: 2019-05-02
scope note: A term used in semantic analysis and referring to words that have the same pronunciation, but they differ in meaning. Homophony appears in pairs such as threw/through, rode/rowed. @en
scope note: Η ομοφωνία στη σημασιολογική ανάλυση αναφέρεται σε λέξεις οι οποίες έχουν την ίδια προφορά, αλλά διαφέρουν στη σημασία. Η ομοφωνία φαίνεται σε ζεύγη όπως threw/through, rode/rowed, λίπη/λύπη και φύλο/φύλλο/φίλο.
broader: Ετερωνυμία

HUMANITIES-THESAURUS
type: ConceptScheme

Ετερωνυμία
type: Concept
notation: 1691
preferred label: Heteronymy @en
narrower: Ομοφωνία