Χριστιανικές θρησκευτικές κοινότητες
type: Concept
notation: 575
preferred label: Christian religious communities @en
related: Ιερέας (Χριστιανισμός)

HUMANITIES-THESAURUS
type: ConceptScheme

Ιερέας (Χριστιανισμός)
type: Concept
preferred label: Priest (Christianity) @en
status: Εκδοθείς
broader: Χριστιανικά θρησκευτικά αξιώματα
contributor: Κατσιαδάκη Ελένη (ΑΑ)
contributor: Katsiadakis Helen (AA) @en
creator: Τζεδόπουλος Γιώργος (ΑΑ)
creator: Tzedopoulos Giorgos (AA) @de
in scheme: HUMANITIES-THESAURUS
related: Χριστιανικές θρησκευτικές κοινότητες
related: Χριστιανικά θρησκευτικά δόγματα
scope note: Ordained member of Christian Churches, who performs liturgical and pastoral duties in the framework of a small community of believers. With the expansion of the Christian church in late antiquity, priests undertook many of the bishops' functions, such as the administration of the sacraments and mass celebration, and were acknowledged as heads of local parishes. This common tradition has marked the development of the office in all Christian denominations despite their differences, as for instance in the issue of the celibacy of the clergy. @en
scope note: Χειροτονημένο μέλος των χριστιανικών Εκκλησιών, που επιτελεί λειτουργικό και ποιμαντορικό έργο στο πλαίσιο μιας μικρής κοινότητας πιστών. Με την επέκταση της χριστιανικής Εκκλησίας στην ύστερη αρχαιότητα, οι ιερείς ανέλαβαν πολλά από τα καθήκοντα των επισκόπων ως προς την τέλεση των μυστηρίων και της λειτουργίας, και τέθηκαν επικεφαλής των τοπικών ενοριών. Αυτή η κοινή παράδοση προσδιορίζει την εξέλιξη του αξιώματος σε όλες τις χριστιανικές Εκκλησίες, παρά τις επιμέρους διαφορές τους, όπως το ζήτημα της αγαμίας του κλήρου.
modified: 2019-07-17
created: 2019-04-05
notation: 1656
source: Fahlbusch et al. 1999-2008

Χριστιανικά θρησκευτικά αξιώματα
type: Concept
notation: 1584
preferred label: Christian religious offices @en
narrower: Ιερέας (Χριστιανισμός)

Χριστιανικά θρησκευτικά δόγματα
type: Concept
notation: 458
preferred label: Christian creeds @en
related: Ιερέας (Χριστιανισμός)