Cursive script
type: Concept
creator: Chrysovitsanos Gerasimos (AA)
creator: Χρυσοβιτσάνος Γεράσιμος (ΑΑ) @el
notation: 1638
scope note: Type of majuscule script for private documents during the Byzantine period
scope note: Τύπος μεγαλογράμματης γραφής που χρησιμοποιούνταν σε ιδιωτικά έγγραφα κατά τη Βυζαντινή περίοδο. @el
alternative label: Koine script
alternative label: Κοινή γραφή @el
source: Κριτζάς (επιμ.) 2003
contributor: Κατσιαδάκη Ελένη (ΑΑ) @el
contributor: Katsiadakis Helen (AA)
modified: 2019-08-09
broader: Majuscule script
in scheme: HUMANITIES-THESAURUS
created: 2019-03-29
status: Εκδοθείς
preferred label: Επισεσυρμένη γραφή @el

Majuscule script
type: Concept
notation: 1636
preferred label: Μεγαλογράμματη γραφή @el
narrower: Cursive script

HUMANITIES-THESAURUS
type: ConceptScheme