Λέξη
type: Concept
status: Εκδοθείς
modified: 2019-07-30
scope note: Η λέξη είναι μια μονάδα του λόγου που αναγνωρίζεται εύκολα από τους φυσικούς ομιλητές στη γλώσσα τους. Ωστόσο, ως επιστημονικό αντικείμενο η λέξη δεν είναι εξίσου εύκολα αναγνωρίσιμη και αναλύσιμη. Αποτελεί αντικείμενο μελέτης της μορφολογίας ως προς την εσωτερική δομή της, της λεξικολογίας ως προς τη σημασία της, αλλά και της λεξικογραφίας ως προς τις πρακτικές πλευρές που αφορούν τη σύνταξη λεξικών. Και η σύνταξη, όμως, μελετά τις λέξεις ως προς τον τρόπο που συντάσσονται σε προτάσεις, αλλά και για τη φωνολογία η λέξη είναι ηχητικό σύνολο με έναν τονισμό. Διαπιστώνεται, δηλαδή, ότι η λέξη αποτελεί μια κεντρική μονάδα της γλωσσολογικής ανάλυσης γενικότερα.
scope note: A single distinct meaningful element of speech or writing, used with others (or sometimes alone) to form a sentence and typically shown with a space on either side when written or printed. A word is a unit which is a constituent at the phrase level and above. It is sometimes identifiable according to such criteria as being the minimal possible unit in a reply, having features such as a regular stress pattern, and phonological changes conditioned by or blocked at word boundaries being the largest unit resistant to insertion of new constituents within its boundaries, or being the smallest constituent that can be moved within a sentence without making the sentence ungrammatical. @en
creator: Καρασίμος Αθανάσιος (ΑΑ)
creator: Karasimos Athanasios (AA) @la
source: Ράλλη 2005
source: Booij 2007
notation: 161
preferred label: Word @en
created: 2015-01-27
contributor: Karasimos Athanasios (AA) @en
contributor: Καρασίμος Αθανάσιος (ΑΑ)
broader: Προτασιακά αντικείμενα
in scheme: HUMANITIES-THESAURUS
narrower: Μόρφημα

Προτασιακά αντικείμενα
type: Concept
notation: 25
preferred label: Propositional objects @en
narrower: Λέξη

HUMANITIES-THESAURUS
type: ConceptScheme

Μόρφημα
type: Concept
notation: 586
preferred label: Morphem @de
preferred label: Morphème @fr
preferred label: Morpheme @en
broader: Λέξη