HUMANITIES-THESAURUS
type: ConceptScheme

Προτασιακά αντικείμενα
type: Concept
notation: 25
preferred label: Propositional objects @en
narrower: Λογοτεχνικός κανόνας

Λογοτεχνικός κανόνας
type: Concept
preferred label: Literary canon @en
contributor: Κατσιαδάκη Ελένη (ΑΑ)
contributor: Katsiadakis Helen (AA) @en
created: 2019-03-15
creator: Kalafata Patritsia (AA) @la
creator: Καλαφατά Πατρίτσια (ΑΑ)
related: Λογοτεχνική κριτική (Τομέας απασχόλησης)
related: Λογοτεχνία (τομέας απασχόλησης)
related: Λογοτεχνία (σύνολο έργων)
in scheme: HUMANITIES-THESAURUS
modified: 2020-10-19
broader: Προτασιακά αντικείμενα
scope note: Όρος που δηλώνει τον κατάλογο των λογοτεχνικών έργων για τα οποία μελετητές και κριτικοί συναινούν στο ότι αποτελούν τα πιο σημαντικά, τα πλέον κλασικά της λογοτεχνικής παραγωγής, παγκόσμιας ή εγχώριας. Είναι τα έργα αυτά που περιλαμβάνονται συνήθως σε ανθολογίες, αλλά και στο πρόγραμμα σπουδών φιλολογικών πανεπιστημιακών τμημάτων.
scope note: Literary canon has come to designate these literary works, that, by a cumulative consensus of critics, scholars, and teachers, have come to be widely recognized as “major,” and as literary classics. These literary works are the ones which, at a given time, are most likely to be included in anthologies and in the syllabi of college courses. @en
status: Εκδοθείς
notation: 1547
source: Abrams&Harpham 2008

Λογοτεχνική κριτική (Τομέας απασχόλησης)
type: Concept
notation: 2538
preferred label: Literary criticism (Discipline) @en
related: Λογοτεχνικός κανόνας

Λογοτεχνία (τομέας απασχόλησης)
type: Concept
notation: 1900
preferred label: Literature (discipline) @en
related: Λογοτεχνικός κανόνας

Λογοτεχνία (σύνολο έργων)
type: Concept
notation: 1860
preferred label: Literature (body of works) @en
related: Λογοτεχνικός κανόνας