Πρεσβυτεριανοί
type: Concept
notation: 1541
preferred label: Presbyterians @en
broader: Καλβινιστές

HUMANITIES-THESAURUS
type: ConceptScheme

Ουγενότοι
type: Concept
notation: 1555
preferred label: Huguenots @en
broader: Καλβινιστές

Χριστιανικά θρησκευτικά δόγματα
type: Concept
notation: 458
preferred label: Christian creeds @en
related: Καλβινιστές

Καλβινιστές
type: Concept
contributor: Katsiadakis Helen (AA) @en
contributor: Κατσιαδάκη Ελένη (ΑΑ)
narrower: Ουγενότοι
narrower: Πρεσβυτεριανοί
related: Χριστιανικά θρησκευτικά δόγματα
in scheme: HUMANITIES-THESAURUS
source: Balserak 2016
scope note: Χριστιανοί προτεστάντες που ακολουθούν ένα σύνολο διδασκαλιών, το οποίο ανάγεται στον Ιωάννη Καλβίνο και άλλους θεολόγους της Μεταρρύθμισης. Στο πλαίσιο αυτό, τονίζεται ιδιαίτερα η σωτηριολογική σημασία του προκαθορισμού και της θείας χάριτος, η ολοκληρωτική ισχύς της αμαρτίας επί των ανθρώπων, και η διάκριση ανάμεσα σε εκλεκτούς και μη εκλεκτούς. Οι καλβινιστές, οι οποίοι διαφωνούν με άλλους προτεστάντες στην ερμηνεία της θείας ευχαριστίας και στην ολοκληρωτική απόρριψη των εικόνων, ανήκουν σε μια σειρά από Εκκλησίες με συχνά ιστορικές διαφορές μεταξύ τους.
scope note: Christian Protestants who follow a set of teachings originating from John Calvin (16th century) and other theologians of the Reformation. Within this set, particular emphasis is given on the soteriological importance of predestination and divine grace, the power of sin over humanity, and the distinction between the elect and the non-elect. Calvinists, who differ from other Protestants in the interpretation of the eucharist and the total rejection of icons, follow several Churches, whose differences are often of historical nature. @en
preferred label: Calvinists @en
creator: Τζεδόπουλος Γιώργος (ΑΑ)
creator: Tzedopoulos Giorgos (AA) @de
created: 2019-03-14
notation: 1540
modified: 2019-04-30
status: Εκδοθείς
broader: Προτεστάντες

Προτεστάντες
type: Concept
notation: 1539
preferred label: Protestants @en
narrower: Καλβινιστές