HUMANITIES-THESAURUS
type: ConceptScheme

Μερωνυμία τμήματος
type: Concept
contributor: Κατσιαδάκη Ελένη (ΑΑ)
contributor: Katsiadakis Helen (AA) @en
preferred label: Portion meronymy @en
notation: 1532
created: 2019-03-14
broader: Μερωνυμία
creator: Karasimos Athanasios (AA) @fr
creator: Καρασίμος Αθανάσιος (ΑΑ)
modified: 2020-10-19
in scheme: HUMANITIES-THESAURUS
status: Εκδοθείς
scope note: The relation of a segment to a preexisting whole, like slice and cake. @en
scope note: Το είδος της μερωνυμίας το οποίο περιγράφει τμήμα μιας προϋπάρχουσας ολότητας, όπως η φέτα ψωμιού με το καρβέλι.

Μερωνυμία
type: Concept
notation: 1529
preferred label: Meronymy @en
narrower: Μερωνυμία τμήματος