HUMANITIES-THESAURUS
type: ConceptScheme

Εγκλεισμός (Σημασιολογία)
type: Concept
source: Saeed 2017
source: Zapata 2008
scope note: Είναι η σημασιολογική σχέση που περιγράφει μια σχέση ενός περιεκτικότερου ή υπερκείμενου όρου με ένα λιγότερο περιεκτικό ή υποκείμενο όρο και αντιστρόφα.
scope note: inclusion is the semantic relationship that exists between two (or more) words in such a way that the meaning of one word includes (or contains) the meaning of other words. @en
broader: Σημασιολογικές σχέσεις
contributor: Katsiadakis Helen (AA) @en
contributor: Κατσιαδάκη Ελένη (ΑΑ)
in scheme: HUMANITIES-THESAURUS
status: Εκδοθείς
creator: Καρασίμος Αθανάσιος (ΑΑ)
creator: Karasimos Athanasios (AA) @la
preferred label: Inclusion @en
created: 2019-03-14
modified: 2020-06-08
notation: 1514

Σημασιολογικές σχέσεις
type: Concept
notation: 1513
preferred label: Semantic relations @en
narrower: Εγκλεισμός (Σημασιολογία)