Νομισματοκοπεία
type: Concept
notation: 1469
modified: 2020-04-04
contributor: Katsiadakis Helen (AA) @en
contributor: Κατσιαδάκη Ελένη (ΑΑ)
creator: Ιακωβίδου Αθηνά (ΑΑ)
creator: Iakovidou Athena (AA) @fr
source: Παπαευθυμίου 2010
source: Howgego 2009
scope note: The places where coins are manufactured. In the ancient Graeco-Roman world these were usually permanent facilities built probably only in cities or kingdoms with a steady and voluminous coin production. In other cases mints could be temporary establishments or even itinerant. We know very little about the nature of these buildings, as today only a few of them have been identified. The term is therefore rather loosely used (at least for the ancient world) to indicate the city of production. @en
scope note: Τα μέρη όπου κατασκευάζονται τα νομίσματα. Στο αρχαίο ελληνο-ρωμαϊκό κόσμο επρόκειτο συνήθως για ειδικά μόνιμα κτήρια που υπήρχαν πιθανότατα μόνο σε πόλεις ή βασίλεια που παρουσίαζαν σταθερή νομισματοκοπία και μεγάλες νομισματικές παραγωγές. Σε άλλες περιπτώσεις, τα νομισματοκοπεία μπορεί να ήταν πρόσκαιρα ή ακόμη και περιοδεύοντα. Γνωρίζουμε ελάχιστα για τα κτήρια αυτά, καθώς σήμερα ελάχιστα είναι ταυτισμένα. Κατά συνέπεια, ο όρος συνήθως χρησιμοποιείται για να υποδηλώσει την πόλη της παραγωγής του νομίσματος και όχι το συγκεκριμένο κτήριο (όσον αφορά τον αρχαίο ελληνικό κόσμο).
preferred label: Μints @en
related: Νομίσματα (πληροφοριακά αντικείμενα)
related: Νομισματική
in scheme: HUMANITIES-THESAURUS
status: Εκδοθείς
created: 2018-11-19
broader: Οικοδομήματα

Νομίσματα (πληροφοριακά αντικείμενα)
type: Concept
notation: 1445
preferred label: Coins (information objects) @en
related: Νομισματοκοπεία

Νομισματική
type: Concept
notation: 1444
preferred label: Numismatics @en
related: Νομισματοκοπεία

HUMANITIES-THESAURUS
type: ConceptScheme

Οικοδομήματα
type: Concept
notation: 158
preferred label: Single built works @en
narrower: Νομισματοκοπεία