Οβολοί (νομίσματα)
type: Concept
notation: 1447
preferred label: Obols (coins) @en
related: Χαλκοί

Νομίσματα (πληροφοριακά αντικείμενα)
type: Concept
notation: 1445
preferred label: Coins (information objects) @en
narrower: Χαλκοί

HUMANITIES-THESAURUS
type: ConceptScheme

Χάλκινα νομίσματα
type: Concept
notation: 2352
preferred label: Bronze coins @en
related: Χαλκοί

Νομισματική
type: Concept
notation: 1444
preferred label: Numismatics @en
related: Χαλκοί

Χαλκοί
type: Concept
modified: 2020-04-05
status: Εκδοθείς
contributor: Katsiadakis Helen (AA) @en
contributor: Κατσιαδάκη Ελένη (ΑΑ)
scope note: Bronze fractions of the obol. In Greece proper they were first introduced in Corinth at the end of the 5th c. BCE. According to ancient sources their value was equivalent to 1/8 of the obol or more often to 1/12 of it. @en
scope note: Χάλκινες υποδιαιρέσεις του οβολού. Στην Κυρίως Ελλάδα πρωτοεμφανίστηκαν στην Κόρινθο στο τέλος του 5ου αι. π.Χ. Σύμφωνα με τις πηγές, η αξία τους ισούταν με το 1/8 του οβολού ή πιο συχνά με το 1/12 αυτού.
creator: Ιακωβίδου Αθηνά (ΑΑ)
creator: Iakovidou Athena (AA) @de
created: 2018-08-27
preferred label: Chalkoi @en
related: Χάλκινα νομίσματα
related: Νομισματική
related: Οβολοί (νομίσματα)
in scheme: HUMANITIES-THESAURUS
source: Amandry, Dhénin, Popoff, Thierry, & Vellet 2002
broader: Νομίσματα (πληροφοριακά αντικείμενα)
notation: 1449