Επίθημα
type: Concept
preferred label: Suffixe @fr
preferred label: Suffix @de
alternative label: Postfix @en
alternative label: Ending affix @en
source: Matthews 1974
source: Booij 2007
source: Ράλλη 2005
source: Carstairs-McCarthy 1992
in scheme: HUMANITIES-THESAURUS
status: Εκδοθείς
scope note: In linguistics, a suffix is an affix which is placed after the stem of a word. Common examples are case endings, which indicate the grammatical case of nouns or adjectives, and verb endings, which form the conjugation of verbs. A word-final segment that is somewhere between a free morpheme and a bound morpheme is known as a suffixoid or a semi-suffix (e.g., English -like or German -freundlich 'friendly'). Suffixes can carry grammatical information (inflectional suffixes) or lexical information (derivational suffixes). An inflectional suffix is sometimes called a desinence. @en
scope note: Το επίθημα είναι το μόρφημα που ακολουθεί το θέμα σε όλες τις διαδικασίες σχηματισμού λέξεων (ποτέ σνάμεσα σε θέματα ή λέξεις της σύνθεσης). Για παράδειγμα το παραγωγικό επίθημα -ικ- που παράγει επίθετα από ουσιαστικά σε λέξεις όπως χρον-ικ-ός, ενώ το κλιτικό επίθημα -ος επιτρέπει στη λέξη να είναι κλιτή.
creator: Karasimos Athanasios (AA) @fr
creator: Καρασίμος Αθανάσιος (ΑΑ)
modified: 2015-11-02
contributor: Katsiadakis Helen (AA) @en
contributor: Κατσιαδάκη Ελένη (ΑΑ)
broader: Πρόσφυμα
narrower: Παραγωγικό επίθημα
narrower: Κλιτικό επίθημα
created: 2015-01-27
notation: 1420

HUMANITIES-THESAURUS
type: ConceptScheme

Πρόσφυμα
type: Concept
notation: 1332
preferred label: Affix @en
preferred label: Affixe @fr
narrower: Επίθημα

Παραγωγικό επίθημα
type: Concept
notation: 1427
preferred label: Derivational suffix @en
preferred label: Derivationssuffix @de
preferred label: Suffixe par dérivation @fr
broader: Επίθημα

Κλιτικό επίθημα
type: Concept
notation: 1430
preferred label: Flexionssuffix @de
preferred label: Suffixe de l'inflexion @fr
preferred label: Inflectional suffix @en
broader: Επίθημα