HUMANITIES-THESAURUS
type: ConceptScheme

Εσωτερική ανάληψη
type: Concept
status: Εκδοθείς
preferred label: Internal analepsis @en
created: 2015-09-30
alternative label: Internal flashback @en
alternative label: Εσωτερική αναδρομή
in scheme: HUMANITIES-THESAURUS
contributor: Kalafata Patritsia (AA) @en
contributor: Καλαφατά Πατρίτσια (ΑΑ)
creator: Kalafata Patritsia (AA) @la
creator: Καλαφατά Πατρίτσια (ΑΑ)
scope note: A flashback to events that took place within the time span of the main story. @en
scope note: Ανάληψη, αναδρομή στο παρελθόν, που κατά ένα μέρος εισχωρεί στην πρωταρχική αφήγηση.
notation: 1418
broader: Ανάληψη (Αφηγηματολογία-Μέθοδοι)
modified: 2018-11-20
source: Τζούμα 1997
source: Genette 1972

Ανάληψη (Αφηγηματολογία-Μέθοδοι)
type: Concept
notation: 1180
preferred label: Analepsis (Narratology-Methods) @en
narrower: Εσωτερική ανάληψη