HUMANITIES-THESAURUS
type: ConceptScheme

Citizenship (honor awarded)
type: Concept
notation: 2084
preferred label: Πολιτεία (απονομή τιμής) @el
related: Decrees awarding citizenship

Decrees awarding citizenship
type: Concept
preferred label: Ψηφίσματα απονομής πολιτείας @el
scope note: Επιγραφές που καταγράφουν ψηφίσματα με τα οποία μία πόλη αποφάσιζε την παραχώρηση πολιτικών δικαιωμάτων, δηλαδή το δικαίωμα ένας ξένος να γίνει πολίτης μιας πόλης, λόγω εξαίρετων πράξεων προς αυτή. Η τιμή ήταν η ύψιστη που μπορούσε να λάβει κάποιος, ιδιαίτερα κατά την κλασική περίοδο. @el
scope note: Decrees, by which a city decided to grant citizen's rights, i.e. the right of a foreigner to become a citizen of a city, due to his outstanding deeds towards it. This was the highest honor awarded, especially during the classical period.
broader: Honorific decrees
created: 2015-05-18
related: Citizenship (honor awarded)
contributor: Katsiadakis Helen (AA)
contributor: Κατσιαδάκη Ελένη (ΑΑ) @el
in scheme: HUMANITIES-THESAURUS
creator: Χρυσοβιτσάνος Γεράσιμος (ΑΑ) @el
creator: Chrysovitsanos Gerasimos (AA)
status: Εκδοθείς
modified: 2019-04-06
source: Θέμος 2007
notation: 1354

Honorific decrees
type: Concept
notation: 1218
preferred label: Τιμητικά ψηφίσματα @el
narrower: Decrees awarding citizenship