HUMANITIES-THESAURUS
type: ConceptScheme

Δεσμευμένο μόρφημα
type: Concept
notation: 849
preferred label: Morphème attaché @fr
preferred label: Gebundenes Morphem @de
preferred label: Bound morpheme @en
narrower: Αλλόμορφο

Αλλόμορφο
type: Concept
in scheme: HUMANITIES-THESAURUS
preferred label: Allomorph @de
preferred label: Allomorphe @fr
source: Ράλλη 2005
source: Booij 2007
source: Carstairs-McCarthy 1992
source: Καρασίμος 2011
creator: Karasimos Athanasios (AA) @de
creator: Καρασίμος Αθανάσιος (ΑΑ)
notation: 1263
modified: 2015-10-28
contributor: Katsiadakis Helen (AA) @en
contributor: Κατσιαδάκη Ελένη (ΑΑ)
created: 2015-01-27
status: Εκδοθείς
scope note: Allomorphs are defined as the different varieties of the same morpheme, which share such lexical information as semantic representation and argument structure, but differ unpredictably and arbitrarily in their phonological form and in the morphological environments in which they occur. @en
scope note: Αλλόμορφα ορίζουμε τις διαφορετικές ποικιλίες του ιδίου μορφήματος, οι οποίες μοιράζονται εξίσου λεξική πληροφορία, όσο και σημασιολογική αναπαράσταση και δομή, διαφέρουν όμως απρόβλεπτα και αυθαίρετα στη φωνολογική τους μορφή και στα μορφολογικά περιβάλλοντα, στα οποία εμφανίζονται.
broader: Δεσμευμένο μόρφημα