HUMANITIES-THESAURUS
type: ConceptScheme

Οχλοκρατία (αριστοτελική φιλοσοφία)
type: Concept
source: Bonitz 1870
source: Ross 1991
source: Duering 1994
source: Λεκατσάς 1939
creator: Σίνου Χριστίνα (ΑΑ)
creator: Sinou Christina (AA) @la
preferred label: Mob rule (Aristotelian philosophy) @en
modified: 2020-04-23
contributor: Κατσιαδάκη Ελένη (ΑΑ)
contributor: Katsiadakis Helen (AA) @en
in scheme: HUMANITIES-THESAURUS
created: 2015-08-04
notation: 1249
broader: Δημοκρατία
scope note: Το είδος του πολιτεύματος, κατά τον Αριστοτέλη, που αποτελεί παρέκβαση της δημοκρατίας και στο οποίο τα αξιώματα απονέμονται όχι βάσει νόμων αλλά βάσει της εκάστοτε πλειοψηφίας (στην Εκκλησία του Δήμου), με αποτέλεσμα την κυριαρχία δημαγωγών.
status: Εκδοθείς

Δημοκρατία
type: Concept
notation: 921
preferred label: Democracy @en
narrower: Οχλοκρατία (αριστοτελική φιλοσοφία)