HUMANITIES-THESAURUS
type: ConceptScheme

Δράμα
type: Concept
notation: 1090
preferred label: Drame @fr
preferred label: Schauspiel @de
preferred label: Drama @en
narrower: Ιστορικό δράμα

Ιστορικό δράμα
type: Concept
contributor: Κατσιαδάκη Ελένη (ΑΑ)
contributor: Katsiadakis Helen (AA) @en
scope note: Subdivision of drama that draws on history in order to throw light on events or people that determined the course of a nation or a certain period. In ages of crisis or major developments, didactics and the enhancement of national identity and continuity of peoples play a prominent role, while during the 20th century playwrights exploited historical material to trace its relations to the contemporary social reality and to delve into philosophical or existential questions. @en
scope note: Υποκατηγορία του δράματος που αντλεί τη θεματική του από την ιστορία, προκειμένου να φωτίσει γεγονότα ή πρόσωπα που σημάδεψαν την πορεία ενός τόπου ή μιας εποχής. Σε περιόδους κρίσεων ή μειζόνων εξελίξεων η διδαχή και η σφυρηλάτηση της εθνικής συνείδησης και της συνέχειας των λαών αποτελούν πρωτεύοντα στόχο, ενώ κατά τον 20ό αιώνα οι συγγραφείς αξιοποιούν το ιστορικό υλικό για να ανιχνεύσουν συσχετισμούς με τη σύγχρονη κοινωνική πραγματικότητα και να εμβαθύνουν σε φιλοσοφικά ή υπαρξιακά ερωτήματα.
creator: Goulis Helen (AA) @la
creator: Γουλή Ελένη (ΑΑ)
source: Λεξικό 2007
source: Χατζηπανταζής 2006
created: 2015-10-27
preferred label: Drame historique @fr
preferred label: Historical drama @en
preferred label: Historisches Drama @de
modified: 2019-02-12
broader: Δράμα
notation: 1212
status: Εκδοθείς
in scheme: HUMANITIES-THESAURUS