Πραγματολογία
type: Concept
source: Mey 1998
source: Horn & Ward 2004
source: Yule 2006
contributor: Κατσιαδάκη Ελένη (ΑΑ)
contributor: Katsiadakis Helen (AA) @en
creator: Karasimos Athanasios (AA) @en
creator: Καρασίμος Αθανάσιος (ΑΑ)
created: 2015-01-25
status: Εκδοθείς
in scheme: HUMANITIES-THESAURUS
notation: 1179
broader: Μικρογλωσσολογία
preferred label: Pragmatik @de
preferred label: Pragmatics @en
preferred label: Pragmatique @fr
scope note: Pragmatics is a subfield of linguistics and semiotics that studies the ways in which context contributes to meaning. Pragmatics encompasses speech act theory, conversational implicature, talk in interaction and other approaches to language behavior in philosophy, sociology, linguistics and anthropology. Unlike semantics, which examines meaning that is conventional or "coded" in a given language, pragmatics studies how the transmission of meaning depends not only on structural and linguistic knowledge (e.g., grammar, lexicon, etc.) of the speaker and listener, but also on the context of the utterance, any pre-existing knowledge about those involved, the inferred intent of the speaker, and other factors. In this respect, pragmatics explains how language users are able to overcome apparent ambiguity, since meaning relies on the manner, place, time etc. of an utterance. @en
scope note: Η Πραγματολογία μπορεί να οριστεί ως ο τομέας της γλωσσολογίας που μελετά τη χρήση της γλώσσας - απηχώντας την ιστορικά πρώτη οριοθέτηση του ομώνυμου χώρου στο πλαίσιο της σημειολογίας και της σχέσης της με την κοινωνιολογία. Αν όμως δεν διευκρινιστεί το περιεχόμενο της κεντρικής έννοιας («χρήση»), θα μπορούσε κανείς να την ταυτίσει άκριτα με τη μελέτη της ομιλίας (parole, κατά τον Saussure) ή της επιτέλεσης (performance, κατά τον Chomsky), διατηρώντας και τις υποκείμενες παραδοχές των διακρίσεων αυτών. Ωστόσο, στο πλαίσιο της πραγματολογίας η χρήση της γλώσσας σημασιοδοτείται στη βάση πτυχών και όψεων της επικοινωνίας (π.χ. προθέσεις και στόχοι των συνομιλούντων ατόμων, οι μεταξύ τους σχέσεις, οι γνώσεις και οι υποθέσεις τους για τον κόσμο, και ιδιαίτερα αυτά που θεωρούν ότι είναι αμοιβαία γνωστά) οι οποίες είναι εκτός πεδίου της δομικής ή/και γενετικής μετασχηματιστικής γλωσσολογίας.
modified: 2015-11-02

HUMANITIES-THESAURUS
type: ConceptScheme

Μικρογλωσσολογία
type: Concept
notation: 740
preferred label: Mikrolinguistique @fr
preferred label: Microlinguistics @en
narrower: Πραγματολογία