Ναυτικοί κατάλογοι
type: Concept
contributor: Κατσιαδάκη Ελένη (ΑΑ)
contributor: Katsiadakis Helen (AA) @en
status: Εκδοθείς
source: Woodhead 2009
creator: Chrysovitsanos Gerasimos (AA) @fr
creator: Χρυσοβιτσάνος Γεράσιμος (ΑΑ)
notation: 1142
broader: Κατάλογοι (Επιγραφές δημοσίου χαρακτήρα)
preferred label: Naval catalogues @en
related: Επιγραφική
in scheme: HUMANITIES-THESAURUS
modified: 2018-12-03
scope note: Inscriptions with catalogues that include a complete census of ships and naval equipment, the persons responsible for them and a reference to their seaworthiness. @en
scope note: Επιγραφές που περιέχουν καταλόγους οι οποίοι περιλαμβάνουν πλήρη απογραφή των πλοίων και του ναυτικού εξοπλισμού, των ανθρώπων που είναι υπεύθυνοι γι' αυτά και μνεία για την αξιόπλοο ή όχι κατάστασή τους.
created: 2015-07-31

Κατάλογοι (Επιγραφές δημοσίου χαρακτήρα)
type: Concept
notation: 1093
preferred label: Catalogues (Public inscriptions) @en
narrower: Ναυτικοί κατάλογοι

Επιγραφική
type: Concept
notation: 573
preferred label: Epigraphy @en
related: Ναυτικοί κατάλογοι

HUMANITIES-THESAURUS
type: ConceptScheme