HUMANITIES-THESAURUS
type: ConceptScheme

Κοσκινάδες
type: Concept
scope note: Οι τεχνίτες που κατασκευάζουν ή και πουλούν κόσκινα.
scope note: Craftsmen who manufacture and/ or sell sieves. @en
contributor: Κατσιαδάκη Ελένη (ΑΑ)
contributor: Katsiadakis Helen (AA) @en
creator: Φαλιέρου Αναστασία (ΑΑ)
creator: Falierou Anastasia (AA) @la
notation: 1105
source: Δαφέρμος 2007
preferred label: Sieve manufacturers @en
modified: 2018-12-29
broader: Τεχνίτες
status: Εκδοθείς
created: 2015-10-25
in scheme: HUMANITIES-THESAURUS

Τεχνίτες
type: Concept
notation: 685
preferred label: Craftsmen @en
narrower: Κοσκινάδες