HUMANITIES-THESAURUS
type: ConceptScheme

Εξουσία των πολλών
type: Concept
notation: 700
preferred label: Rule by the many @en
narrower: Πολιτεία (αριστοτελική φιλοσοφία)

Πολιτεία (αριστοτελική φιλοσοφία)
type: Concept
created: 2015-08-04
contributor: Katsiadakis Helen (AA) @en
contributor: Κατσιαδάκη Ελένη (ΑΑ)
notation: 1080
scope note: Το πολίτευμα της ορθής δημοκρατίας, κατά τον Αριστοτέλη, που αποτελεί ένα μεικτό πολίτευμα από ποικίλα στοιχεία άλλων πολιτευμάτων, και στο οποίο την εξουσία ασκεί η μέση οικονομικά τάξη.
source: Duering 1994
source: Ross 1991
source: Λεκατσάς 1939
source: Bonitz 1870
in scheme: HUMANITIES-THESAURUS
preferred label: Polity (Aristotelian philosophy) @en
creator: Sinou Christina (AA) @la
creator: Σίνου Χριστίνα (ΑΑ)
modified: 2020-04-23
broader: Εξουσία των πολλών
status: Εκδοθείς